{"text_format":"1","workbook":"xlsx","n_sheets":28,"sheets":["Instructions","Menu","2016 Universal Input Prices","Irr Alfalfa","Irr Blackeyes","Irr Corn","Irr Corn Silage","Irr Cotton Drip","Irr Cotton Pivot","Irr Guar","Irr Peanuts","Irr Sesame","Irr Sorghum","Irr Sorghum Silage","Irr Soybeans","Irr Sunflowers-Confection","Irr Sunflowers-Oilseed","Irr Wheat","Dry Cotton Conventional","Dry Cotton HT","Dry Guar","Dry Sesame","Dry Sorghum","Dry Sunflowers-Oilseed","Dry Wheat","Break-Even Comparison","Comparative Returns","Whole Farm Scenario"],"not_rendered":{"charts":0,"images":37,"macros":1,"external_links":1,"defined_names":112,"comments":23,"pivot_tables":0},"unopened":[],"bounds":{"document_bytes":16777216,"sheet_cells":100000,"rows_first":2000,"rows_last":500,"rows_between":2000,"halvings":0,"cell_chars":16384,"cell_head_chars":4096},"cells_cut":0,"cells_raw":0,"read":"whole","date_system":"1900"}

{"sheet":"Instructions","index":0,"n_rows":54,"n_cols":2,"rows_kept":54,"cut":false,"hidden":false,"merged":[[53,0,55,8],[58,0,59,8],[21,0,24,5],[35,0,38,8],[41,0,44,8],[57,1,57,8],[46,1,46,8],[47,0,50,8],[52,1,52,8],[5,9,5,14],[40,1,40,8],[26,1,26,8],[15,0,19,8],[14,1,14,8],[8,2,12,8],[31,0,33,8],[27,0,29,8]]}
[]
["Version 01.03.2016"]
[]
[]
[]
[]
[]
[]
{"$rows_left_out":47}
{"sheet":"Menu","index":1,"n_rows":26,"n_cols":4,"rows_kept":26,"cut":false,"hidden":false,"merged":[[2,3,2,6]]}
[]
[]
[null,"Budgets",null,"Analysis Selection"]
[null,{"$f":"'Irr Alfalfa'!$A$3","v":"Irrigated Alfalfa "}]
[null,{"$f":"'Irr Blackeyes'!$A$3","v":"Irrigated Blackeyed Peas"}]
[null,{"$f":"'Irr Corn'!$A$3","v":"Irrigated Corn"}]
[null,{"$f":"'Irr Corn Silage'!$A$3","v":"Irrigated Corn Silage"}]
[null,{"$f":"'Irr Cotton Drip'!$A$3","v":"Irrigated Cotton - Drip"}]
{"$rows_left_out":19}
{"sheet":"2016 Universal Input Prices","index":2,"n_rows":47,"n_cols":11,"rows_kept":47,"cut":false,"hidden":false,"merged":[]}
[]
[null,"Basic Universal Input Prices"]
[null,"Commodity","Price","Unit","Verified"]
[null,"Alfalfa",190,"/ton","x"]
[null,"Blackeyed Peas",0.35,"/lb","x"]
[null,"Corn",4,"/bu","x"]
[null,"Corn Silage",38,"/ton","x"]
[null,"Cotton",0.6,"/lb","x"]
{"$rows_left_out":40}
{"sheet":"Irr Alfalfa","index":3,"n_rows":69,"n_cols":9,"rows_kept":69,"cut":false,"hidden":false,"merged":[[1,0,1,7],[2,0,2,7],[3,0,3,7]]}
[]
[" Estimated Costs and Returns per Acre"]
["Irrigated Alfalfa "]
["Projected for 2016"]
[null,null,null,null,null,null,null,"Rental Agreement","Share"]
["Item ","Quantity","Unit","Price","Owner"," ",null,"Share","Cash"]
[null,null,null,null,"Share","Total","Operator","Owner"]
["Income"]
{"$rows_left_out":62}
{"sheet":"Irr Blackeyes","index":4,"n_rows":67,"n_cols":9,"rows_kept":67,"cut":false,"hidden":false,"merged":[[1,0,1,7],[2,0,2,7],[3,0,3,7]]}
[]
[" Estimated Costs and Returns per Acre"]
["Irrigated Blackeyed Peas"]
["Projected for 2016"]
[null,null,null,null,null,null,null,"Rental Agreement"]
["Item ","Quantity","Unit","Price","Owner",null,null,"Share","Cash"]
[null,null,null,null,"Share","Total","Operator","Owner"]
["Income"]
{"$rows_left_out":60}
{"sheet":"Irr Corn","index":5,"n_rows":67,"n_cols":9,"rows_kept":67,"cut":false,"hidden":false,"merged":[[1,0,1,7],[2,0,2,7],[3,0,3,7]]}
[]
[" Estimated Costs and Returns per Acre"]
["Irrigated Corn"]
["Projected for 2016"]
[null,null,null,null,null,null,null,"Rental Agreement","Share"]
["Item ","Quantity","Unit","Price","Owner"," ",null,"Share","Cash"]
[null,null,null,null,"Share","Total","Operator","Owner"]
["Income"]
{"$rows_left_out":60}
{"sheet":"Irr Corn Silage","index":6,"n_rows":67,"n_cols":9,"rows_kept":67,"cut":false,"hidden":false,"merged":[[1,0,1,7],[2,0,2,7],[3,0,3,7]]}
[]
[" Estimated Costs and Returns per Acre"]
["Irrigated Corn Silage"]
["Projected for 2016"]
[null,null,null,null,null,null,null,"Rental Agreement","Share"]
["Item ","Quantity","Unit","Price","Owner"," ",null,"Share","Cash"]
[null,null,null,null,"Share","Total","Operator","Owner"]
["Income"]
{"$rows_left_out":60}
{"sheet":"Irr Cotton Drip","index":7,"n_rows":75,"n_cols":9,"rows_kept":75,"cut":false,"hidden":false,"merged":[[1,0,1,7],[2,0,2,7],[3,0,3,7]]}
[]
[" Estimated Costs and Returns per Acre"]
["Irrigated Cotton - Drip"]
["Projected for 2016"]
[null,null,null,null,null,null,null,"Rental Agreement","Share"]
["Item ","Quantity","Unit","Price","Owner"," ",null,"Share","Cash"]
[null,null,null,null,"Share","Total","Operator","Owner"]
["Income"]
{"$rows_left_out":68}
{"sheet":"Irr Cotton Pivot","index":8,"n_rows":74,"n_cols":9,"rows_kept":74,"cut":false,"hidden":false,"merged":[[1,0,1,7],[2,0,2,7],[3,0,3,7]]}
[]
[" Estimated Costs and Returns per Acre"]
["Irrigated Cotton - Pivot"]
["Projected for 2016"]
[null,null,null,null,null,null,null,"Rental Agreement","Share"]
["Item ","Quantity","Unit","Price","Owner"," ",null,"Share","Cash"]
[null,null,null,null,"Share","Total","Operator","Owner"]
["Income"]
{"$rows_left_out":67}
{"sheet":"Irr Guar","index":9,"n_rows":68,"n_cols":9,"rows_kept":68,"cut":false,"hidden":false,"merged":[[1,0,1,7],[2,0,2,7],[3,0,3,7]]}
[]
[" Estimated Costs and Returns per Acre"]
["Irrigated Guar"]
["Projected for 2016"]
[null,null,null,null,null,null,null,"Rental Agreement","Share"]
["Item ","Quantity","Unit","Price","Owner"," ",null,"Share","Cash"]
[null,null,null,null,"Share","Total","Operator","Owner"]
["Income"]
{"$rows_left_out":61}
{"sheet":"Irr Peanuts","index":10,"n_rows":71,"n_cols":9,"rows_kept":71,"cut":false,"hidden":false,"merged":[[1,0,1,7],[2,0,2,7],[3,0,3,7]]}
[]
[" Estimated Costs and Returns per Acre"]
["Irrigated Peanuts"]
["Projected for 2016"]
[null,null,null,null,null,null,null,"Rental Agreement","Share"]
["Item ","Quantity","Unit","Price","Owner"," ",null,"Share","Cash"]
[null,null,null,null,"Share","Total","Operator","Owner"]
["Income"]
{"$rows_left_out":64}
{"sheet":"Irr Sesame","index":11,"n_rows":68,"n_cols":9,"rows_kept":68,"cut":false,"hidden":false,"merged":[[1,0,1,7],[2,0,2,7],[3,0,3,7]]}
[]
[" Estimated Costs and Returns per Acre"]
["Irrigated Sesame"]
["Projected for 2016"]
[null,null,null,null,null,null,null,"Rental Agreement","Share"]
["Item ","Quantity","Unit","Price","Owner",null,null,"Share","Cash"]
[null,null,null,null,"Share","Total","Operator","Owner"]
["Income"]
{"$rows_left_out":61}
{"sheet":"Irr Sorghum","index":12,"n_rows":67,"n_cols":9,"rows_kept":67,"cut":false,"hidden":false,"merged":[[1,0,1,7],[2,0,2,7],[3,0,3,7]]}
[]
[" Estimated Costs and Returns per Acre"]
["Irrigated Sorghum"]
["Projected for 2016"]
[null,null,null,null,null,null,null,"Rental Agreement","Share"]
["Item ","Quantity","Unit","Price","Owner"," ",null,"Share","Cash"]
[null,null,null,null,"Share","Total","Operator","Owner"]
["Income"]
{"$rows_left_out":60}
{"sheet":"Irr Sorghum Silage","index":13,"n_rows":66,"n_cols":9,"rows_kept":66,"cut":false,"hidden":false,"merged":[[1,0,1,7],[2,0,2,7],[3,0,3,7]]}
[]
[" Estimated Costs and Returns per Acre"]
["Irrigated Sorghum Silage"]
["Projected for 2016"]
[null,null,null,null,null,null,null,"Rental Agreement","Share"]
["Item ","Quantity","Unit","Price","Owner"," ",null,"Share","Cash"]
[null,null,null,null,"Share","Total","Operator","Owner"]
["Income"]
{"$rows_left_out":59}
{"sheet":"Irr Soybeans","index":14,"n_rows":69,"n_cols":9,"rows_kept":69,"cut":false,"hidden":false,"merged":[[1,0,1,7],[2,0,2,7],[3,0,3,7]]}
[]
[" Estimated Costs and Returns per Acre"]
["Irrigated Soybeans"]
["Projected for 2016"]
[null,null,null,null,null,null,null,"Rental Agreement","Share"]
["Item ","Quantity","Unit","Price","Owner"," ",null,"Share","Cash"]
[null,null,null,null,"Share","Total","Operator","Owner"]
["Income"]
{"$rows_left_out":62}
{"sheet":"Irr Sunflowers-Confection","index":15,"n_rows":68,"n_cols":9,"rows_kept":68,"cut":false,"hidden":false,"merged":[[1,0,1,7],[2,0,2,7],[3,0,3,7]]}
[]
[" Estimated Costs and Returns per Acre"]
["Irrigated Sunflowers-Confectionary "]
["Projected for 2016"]
[null,null,null,null,null,null,null,"Rental Agreement","Share"]
["Item ","Quantity","Unit","Price","Owner"," ",null,"Share","Cash"]
[null,null,null,null,"Share","Total","Operator","Owner"]
["Income"]
{"$rows_left_out":61}
{"sheet":"Irr Sunflowers-Oilseed","index":16,"n_rows":67,"n_cols":9,"rows_kept":67,"cut":false,"hidden":false,"merged":[[1,0,1,7],[2,0,2,7],[3,0,3,7]]}
[]
[" Estimated Costs and Returns per Acre"]
["Irrigated Sunflowers-Oilseed "]
["Projected for 2016"]
[null,null,null,null,null,null,null,"Rental Agreement","Share"]
["Item ","Quantity","Unit","Price","Owner"," ",null,"Share","Cash"]
[null,null,null,null,"Share","Total","Operator","Owner"]
["Income"]
{"$rows_left_out":60}
{"sheet":"Irr Wheat","index":17,"n_rows":66,"n_cols":9,"rows_kept":66,"cut":false,"hidden":false,"merged":[[1,0,1,7],[2,0,2,7],[3,0,3,7]]}
[]
[" Estimated Costs and Returns per Acre"]
["Irrigated Wheat"]
["Projected for 2016"]
[null,null,null,null,null,null,null,"Rental Agreement","Share"]
["Item ","Quantity","Unit","Price","Owner"," ",null,"Share","Cash"]
[null,null,null,null,"Share","Total","Operator","Owner"]
["Income"]
{"$rows_left_out":59}
{"sheet":"Dry Cotton Conventional","index":18,"n_rows":65,"n_cols":9,"rows_kept":65,"cut":false,"hidden":false,"merged":[[1,0,1,7],[2,0,2,7],[3,0,3,7]]}
[]
[" Estimated Costs and Returns per Acre"]
["Dryland Cotton - Conventional"]
["Projected for 2016"]
[null,null,null,null,null,null,null,"Rental Agreement","Share"]
["Item ","Quantity","Unit","Price","Owner"," ",null,"Share","Cash"]
[null,null,null,null,"Share","Total","Operator","Owner"]
["Income"]
{"$rows_left_out":58}
{"sheet":"Dry Cotton HT","index":19,"n_rows":66,"n_cols":9,"rows_kept":66,"cut":false,"hidden":false,"merged":[[1,0,1,7],[2,0,2,7],[3,0,3,7]]}
[]
[" Estimated Costs and Returns per Acre"]
["Dryland Cotton - Herbicide Tolerant"]
["Projected for 2016"]
[null,null,null,null,null,null,null,"Rental Agreement","Share"]
["Item ","Quantity","Unit","Price","Owner"," ",null,"Share","Cash"]
[null,null,null,null,"Share","Total","Operator","Owner"]
["Income"]
{"$rows_left_out":59}
{"sheet":"Dry Guar","index":20,"n_rows":60,"n_cols":9,"rows_kept":60,"cut":false,"hidden":false,"merged":[[1,0,1,7],[2,0,2,7],[3,0,3,7]]}
[]
[" Estimated Costs and Returns per Ground Acre"]
["Dryland Guar"]
["Projected for 2016"]
[null,null,null,null,null,null,null,"Rental Agreement","Share"]
["Item ","Quantity","Unit","Price","Owner",null,null,"Share","Cash"]
[null,null,null,null,"Share","Total","Operator","Owner"]
["Income"]
{"$rows_left_out":53}
{"sheet":"Dry Sesame","index":21,"n_rows":59,"n_cols":9,"rows_kept":59,"cut":false,"hidden":false,"merged":[[1,0,1,7],[2,0,2,7],[3,0,3,7]]}
[]
[" Estimated Costs and Returns per Ground Acre"]
["Dryland Sesame"]
["Projected for 2016"]
[null,null,null,null,null,null,null,"Rental Agreement","Share"]
["Item ","Quantity","Unit","Price","Owner",null,null,"Share","Cash"]
[null,null,null,null,"Share","Total","Operator","Owner"]
["Income"]
{"$rows_left_out":52}
{"sheet":"Dry Sorghum","index":22,"n_rows":60,"n_cols":9,"rows_kept":60,"cut":false,"hidden":false,"merged":[[1,0,1,7],[2,0,2,7],[3,0,3,7]]}
[]
[" Estimated Costs and Returns per Acre"]
["Dryland Sorghum"]
["Projected for 2016"]
[null,null,null,null,null,null,null,"Rental Agreement","Share"]
["Item ","Quantity","Unit","Price","Owner"," ",null,"Share","Cash"]
[null,null,null,null,"Share","Total","Operator","Owner"]
["Income"]
{"$rows_left_out":53}
{"sheet":"Dry Sunflowers-Oilseed","index":23,"n_rows":59,"n_cols":9,"rows_kept":59,"cut":false,"hidden":false,"merged":[[1,0,1,7],[2,0,2,7],[3,0,3,7]]}
[]
[" Estimated Costs and Returns per Acre"]
["Dryland Sunflowers-Oilseed "]
["Projected for 2016"]
[null,null,null,null,null,null,null,"Rental Agreement","Share"]
["Item ","Quantity","Unit","Price","Owner"," ",null,"Share","Cash"]
[null,null,null,null,"Share","Total","Operator","Owner"]
["Income"]
{"$rows_left_out":52}
{"sheet":"Dry Wheat","index":24,"n_rows":59,"n_cols":9,"rows_kept":59,"cut":false,"hidden":false,"merged":[[1,0,1,7],[2,0,2,7],[3,0,3,7]]}
[]
[" Estimated Costs and Returns per Acre"]
["Dryland Wheat"]
["Projected for 2016"]
[null,null,null,null,null,null,null,"Rental Agreement","Share"]
["Item ","Quantity","Unit","Price","Owner"," ",null,"Share","Cash"]
[null,null,null,null,"Share","Total","Operator","Owner"]
["Income"]
{"$rows_left_out":52}
{"sheet":"Break-Even Comparison","index":25,"n_rows":201,"n_cols":9,"rows_kept":201,"cut":false,"hidden":false,"merged":[[157,0,157,8],[158,4,158,5],[158,6,158,8],[193,0,193,8],[194,4,194,5],[194,6,194,8],[175,0,175,8],[176,4,176,5],[176,6,176,8],[184,0,184,8],[185,4,185,5],[185,6,185,8],[166,0,166,8],[167,4,167,5],[167,6,167,8],[139,0,139,8],[140,4,140,5],[140,6,140,8],[148,0,148,8],[149,4,149,5],[149,6,149,8],[121,0,121,8],[122,4,122,5],[122,6,122,8],[130,0,130,8],[131,4,131,5],[131,6,131,8],[103,0,103,8],[104,4,104,5],[104,6,104,8],[112,0,112,8],[113,4,113,5],[113,6,113,8],[95,4,95,5],[95,6,95,8],[58,0,58,8],[59,4,59,5],[59,6,59,8],[1,0,1,8],[2,0,2,8],[22,0,22,8],[31,0,31,8],[49,0,49,8],[32,4,32,5],[23,4,23,5],[23,6,23,8],[4,0,4,8],[5,4,5,5],[32,6,32,8],[5,6,5,8],[13,0,13,8],[14,4,14,5],[14,6,14,8],[40,0,40,8],[41,4,41,5],[41,6,41,8],[94,0,94,8],[86,6,86,8],[86,4,86,5],[85,0,85,8],[68,4,68,5],[68,6,68,8],[67,0,67,8],[50,4,50,5],[50,6,50,8],[76,0,76,8],[77,4,77,5],[77,6,77,8]]}
[]
["Comparative Break-Even Analysis Projected for 2016"]
[]
[]
[{"$f":"'Irr Alfalfa'!A3:H3","v":"Irrigated Alfalfa "}]
[null,null,null,null,"BE Price to Cover Variable Costs",null,"BE Price to Cover Total Costs"]
["Yield",{"$f":"'Irr Alfalfa'!C9","v":"tons"},null,null,"Total","Operator","Total","Operator","Owner"]
[0.75,{"$f":"'Irr Alfalfa'!$B$9*$A8","v":4.5},{"$f":"'Irr Alfalfa'!$B$9*(1-'Irr Alfalfa'!$E$9)*$A8","v":3.375},{"$f":"'Irr Alfalfa'!$B$9*'Irr Alfalfa'!$E$9*$A8","v":1.125},{"$f":"('Irr Alfalfa'!F$47+(B8-B$10)*('Irr Alfalfa'!$D$25))/B8","v":158.68537017973856},{"$f":"('Irr Alfalfa'!G$47+(C8-C$10)*('Irr Alfalfa'!$D$25))/C8","v":181.47685166122005},{"$f":"('Irr Alfalfa'!F$62+(B8-B$10)*('Irr Alfalfa'!$D$25))/B8","v":222.51870351307187},{"$f":"('Irr Alfalfa'!G$62+(C8-C$10)*('Irr Alfalfa'!$D$25))/C8","v":225.40277758714598},{"$f":"IF($D8=0,\"N/A\",('Irr Alfalfa'!H$62+(D8-D$10)*('Irr Alfalfa'!$D$25))/D8)","v":213.86648129084966}]
{"$rows_left_out":194}
{"sheet":"Comparative Returns","index":26,"n_rows":28,"n_cols":25,"rows_kept":28,"cut":false,"hidden":false,"merged":[[4,1,4,3],[4,22,4,24],[4,7,4,9],[4,14,4,16],[4,17,4,19],[4,4,4,6],[4,10,4,12]]}
[]
["Comparative Returns"]
["Projected for 2016"]
[]
[null,"Total Revenue",null,null,"Total Variable Costs",null,null,"Return Over Variable Costs",null,null,"Total Costs",null,null,null,"Return Over Variable Costs\nper Acre-Inch Applied",null,null,"Return Over Total Costs",null,null,null,null,"Break-Even Yield to Cover \nTotal Costs"]
[null,"Total","Operator","Owner","Total","Operator","Owner","Total","Operator","Owner","Total","Operator","Owner","ac-in","Total","Operator","Owner","Total","Operator","Owner","Price","unit","Total","Operator","Owner"]
[{"$f":"'Irr Alfalfa'!$A$3:$H$3","v":"Irrigated Alfalfa "},{"$f":"'Irr Alfalfa'!F$11","v":1140},{"$f":"'Irr Alfalfa'!G$11","v":855},{"$f":"'Irr Alfalfa'!H$11","v":285},{"$f":"'Irr Alfalfa'!F$47","v":789.08416580882351},{"$f":"'Irr Alfalfa'!G$47","v":668.73437435661765},{"$f":"'Irr Alfalfa'!H$47","v":120.34979145220588},{"$f":"B7-E7","v":350.91583419117649},{"$f":"C7-F7","v":186.26562564338235},{"$f":"D7-G7","v":164.65020854779414},{"$f":"'Irr Alfalfa'!F$62","v":1076.3341658088234},{"$f":"'Irr Alfalfa'!G$62","v":816.98437435661765},{"$f":"'Irr Alfalfa'!H$62","v":259.34979145220586},{"$f":"'Irr Alfalfa'!B36","v":24},{"$f":"IF($N7=0,\"-\",H7/$N7)","v":14.621493091299021},{"$f":"IF($N7=0,\"-\",I7/$N7)","v":7.761067735140931},{"$f":"IF($N7=0,\"-\",J7/$N7)","v":6.860425356158089},{"$f":"B7-K7","v":63.6658341911766},{"$f":"C7-L7","v":38.01562564338235},{"$f":"D7-M7","v":25.650208547794136},{"$f":"'Irr Alfalfa'!$D$9","v":190},{"$f":"'Irr Alfalfa'!$C$9","v":"tons"},{"$f":"IF($U7=0, 0, K7/$U7)","v":5.6649166621517022},{"$f":"IF($U7=0, 0, IF('Irr Alfalfa'!$E$9=0,0,L7/$U7/(1-'Irr Alfalfa'!$E$9)))","v":5.7332236796955627},{"$f":"IF($U7=0, 0, IF('Irr Alfalfa'!$E$9=0,0,M7/$U7/('Irr Alfalfa'!$E$9)))","v":5.4599956095201234}]
[{"$f":"'Irr Blackeyes'!$A$3:$H$3","v":"Irrigated Blackeyed Peas"},{"$f":"'Irr Blackeyes'!F$11","v":647.5},{"$f":"'Irr Blackeyes'!G$11","v":485.625},{"$f":"'Irr Blackeyes'!H$11","v":161.875},{"$f":"'Irr Blackeyes'!F$46","v":271.71754999999996},{"$f":"'Irr Blackeyes'!G$46","v":243.01442500000002},{"$f":"'Irr Blackeyes'!H$46","v":28.703125},{"$f":"B8-E8","v":375.78245000000004},{"$f":"C8-F8","v":242.61057499999998},{"$f":"D8-G8","v":133.171875},{"$f":"'Irr Blackeyes'!F$60","v":460.96754999999996},{"$f":"'Irr Blackeyes'!G$60","v":293.26442500000002},{"$f":"'Irr Blackeyes'!H$60","v":167.703125},{"$f":"'Irr Blackeyes'!B39","v":1},{"$f":"IF($N8=0,\"-\",H8/$N8)","v":375.78245000000004},{"$f":"IF($N8=0,\"-\",I8/$N8)","v":242.61057499999998},{"$f":"IF($N8=0,\"-\",J8/$N8)","v":133.171875},{"$f":"B8-K8","v":186.53245000000004},{"$f":"C8-L8","v":192.36057499999998},{"$f":"D8-M8","v":-5.828125},{"$f":"'Irr Blackeyes'!$D$9","v":0.35},{"$f":"'Irr Blackeyes'!$C$9","v":"lbs"},{"$f":"IF($U8=0, 0, K8/$U8)","v":1317.0501428571429},{"$f":"IF($U8=0, 0, IF('Irr Blackeyes'!$E$9=0,0,L8/$U8/(1-'Irr Blackeyes'!$E$9)))","v":1117.1978095238096},{"$f":"IF($U8=0, 0, IF('Irr Blackeyes'!$E$9=0,0,M8/$U8/('Irr Blackeyes'!$E$9)))","v":1916.6071428571429}]
{"$rows_left_out":21}
{"sheet":"Whole Farm Scenario","index":27,"n_rows":79,"n_cols":22,"rows_kept":79,"cut":false,"hidden":false,"merged":[[1,1,1,10],[3,2,3,4],[11,5,11,10]]}
[]
[null,"Whole Farm Comparative Profitability, Irrigation Capacity and Risk Analysis"]
[]
[null,"Farm Name","ABC Farm"]
[null,"Acres covered by irrigation system",120]
[null,"Total cropland acres",160]
[null,"Irrigation capacity in GPM",350]
[null,"Total number of days to irrigate",100]
{"$rows_left_out":71}